BDBM50039771 3-Allyl-2,3,3a,4,5,9b-hexahydro-1H-benzo[e]indole-6-carboxylic acid amide::CHEMBL96726
SMILES NC(=O)c1cccc2C3CCN(CC=C)C3CCc12
InChI Key InChIKey=ITRJBWXLLLCDGV-UHFFFAOYSA-N
Data  5 KI
  Tab Delimited (TSV)   2D SDfile   Computed 3D by Vconf -m prep SDfile
Find this compound or compounds like it in BindingDB:
Activity Spreadsheet -- Enzyme Inhibition Constant Data from BindingDB
Found 3 hits for monomerid = 50039771
TargetD(2) dopamine receptor(Rattus norvegicus (rat))
University Of G£Teborg
Curated by ChEMBL
LigandPNGBDBM50039771(3-Allyl-2,3,3a,4,5,9b-hexahydro-1H-benzo[e]indole-...)
Affinity DataKi: >172nM. Assay description: Affinity against striatal dopamine D2 receptors using [3H]spiperone as radioligand in rats.
In DepthDetails ArticlePubMed
TargetD(2) dopamine receptor(Homo sapiens (Human))
University Of G£Teborg
Curated by ChEMBL
LigandPNGBDBM50039771(3-Allyl-2,3,3a,4,5,9b-hexahydro-1H-benzo[e]indole-...)
Affinity DataKi: >217nM. Assay description: Affinity against recombinant dopamine receptor (DA) D2 expressed in CHO-K1 cells, using [3H]-spiperone as radioligand
In DepthDetails ArticlePubMed
TargetD(2) dopamine receptor(Homo sapiens (Human))
University Of G£Teborg
Curated by ChEMBL
LigandPNGBDBM50039771(3-Allyl-2,3,3a,4,5,9b-hexahydro-1H-benzo[e]indole-...)
Affinity DataKi: >1.50E+3nM. Assay description: In vitro binding affinity against cloned mammalian dopamine D2 autoreceptor, expressed in CHO-K1 cells, using [3H]U-86170 as radioligand
In DepthDetails ArticlePubMed